{"text_format":"1","workbook":"xlsx","n_sheets":4,"sheets":["CreateQuiz","QuizSheet","QuizResults","Monte Carlo"],"not_rendered":{"charts":0,"images":6,"macros":1,"external_links":0,"defined_names":1,"comments":0,"pivot_tables":0},"unopened":[],"bounds":{"document_bytes":16777216,"sheet_cells":100000,"rows_first":2000,"rows_last":500,"rows_between":2000,"halvings":0,"cell_chars":16384,"cell_head_chars":4096},"cells_cut":0,"cells_raw":0,"read":"whole","date_system":"1900"}

{"sheet":"CreateQuiz","index":0,"n_rows":100,"n_cols":34,"rows_kept":100,"cut":false,"hidden":false,"merged":[[95,3,99,3],[95,4,99,4],[95,5,99,5],[95,6,99,6],[25,3,29,3],[25,4,29,4],[25,5,29,5],[25,6,29,6],[30,3,34,3],[30,4,34,4],[30,5,34,5],[30,6,34,6],[35,3,39,3],[35,4,39,4],[35,5,39,5],[35,6,39,6],[20,3,24,3],[20,4,24,4],[20,5,24,5],[20,6,24,6],[5,3,9,3],[10,3,14,3],[10,5,14,5],[10,6,14,6],[10,4,14,4],[15,3,19,3],[15,4,19,4],[15,5,19,5],[15,6,19,6],[0,28,4,28],[0,29,4,29],[5,5,9,5],[0,4,0,9],[5,6,9,6],[5,4,9,4],[0,26,4,26],[0,27,4,27],[3,3,3,4],[40,3,44,3],[40,4,44,4],[40,5,44,5],[40,6,44,6],[45,3,49,3],[45,4,49,4],[45,5,49,5],[45,6,49,6],[50,3,54,3],[50,4,54,4],[50,5,54,5],[50,6,54,6],[55,3,59,3],[55,4,59,4],[55,5,59,5],[55,6,59,6],[60,3,64,3],[60,4,64,4],[60,5,64,5],[60,6,64,6],[65,3,69,3],[65,4,69,4],[65,5,69,5],[65,6,69,6],[70,3,74,3],[70,4,74,4],[70,5,74,5],[70,6,74,6],[75,3,79,3],[75,4,79,4],[75,5,79,5],[75,6,79,6],[90,3,94,3],[90,4,94,4],[90,5,94,5],[90,6,94,6],[80,3,84,3],[80,4,84,4],[80,5,84,5],[80,6,84,6],[85,3,89,3],[85,4,89,4],[85,5,89,5],[85,6,89,6]]}
[null,null,null,null,"Risk Assessment Questions ",null,null,null,null,null,null,null,null,null,null,null,null,null,null,null,null,null,null,null,null,null,null,null,null,null,null,null,null,0]
[null,null,null,null,null,null,null,null,null,null,null,null,null,null,null,null,null,null,null,null,null,null,null,null,null,null,null,null,null,null,null,null,null,1]
[null,null,null,null,null,null,null,null,null,null,null,null,null,null,null,null,null,null,null,null,null,null,null,null,null,null,null,null,null,null,null,null,null,2]
[null,null,null,"Quiz Name:",null,"Risk Assessment Test",null,null,null,{"$f":"D4:J4","v":0},null,null,null,null,null,null,null,null,null,null,null,null,null,null,null,null,null,null,null,null,null,null,null,3]
["Sel. Quest. Row ",66,null,"Question #","Question Type","Question","Add Picture","Possible Answers","Correct Answer(s)",null,null,null,null,null,null,null,null,null,null,null,null,null,null,null,null,null,null,null,null,null,null,null,null,4]
[null,null,null,1,"Checkboxes","How many users do you have? ",null,"High (1000 +)","ü",null,0]
[null,null,null,null,null,null,null,"Medium (500-1000)","ü",null,1]
[null,null,null,null,null,null,null,"Low (0 - 500)","ü",null,2]
[null,null,null,null,null,null,null,null,null,null,3]
[null,null,null,null,null,null,null,null,null,null,4]
[null,null,null,{"$f":"D6+1","v":2},"Multiple Choice","Do you use windows?",null,"Yes","ü",null,0]
[null,null,null,null,null,null,null,"No",null,null,1]
[null,null,null,null,null,null,null,null,null,null,2]
[null,null,null,null,null,null,null,null,null,null,3]
[null,null,null,null,null,null,null,null,null,null,4]
[null,null,null,{"$f":"D11+1","v":3},"Multiple Choice","Do you use Anti-virus?",null,"Yes",null,null,0]
[null,null,null,null,null,null,null,"No","ü",null,1]
[null,null,null,null,null,null,null,null,null,null,2]
[null,null,null,null,null,null,null,null,null,null,3]
[null,null,null,null,null,null,null,null,null,null,4]
[null,null,null,{"$f":"D16+1","v":4},"Checkboxes","How often do you perform system scans?",null,"Daily",null,null,0]
[null,null,null,null,null,null,null,"Weekly",null,null,1]
[null,null,null,null,null,null,null,"Monthly","ü",null,2]
[null,null,null,null,null,null,null,"Never","ü",null,3]
[null,null,null,null,null,null,null,null,null,null,4]
[null,null,null,{"$f":"D21+1","v":5},"Checkboxes","Is your hardware up to date?",null,"Yes","ü",null,0]
[null,null,null,null,null,null,null,"No","ü",null,1]
[null,null,null,null,null,null,null,null,null,null,2]
[null,null,null,null,null,null,null,null,null,null,3]
[null,null,null,null,null,null,null,null,null,null,4]
[null,null,null,{"$f":"D26+1","v":6},"Checkboxes","Is your system up to date?",null,"Yes","ü",null,0]
[null,null,null,null,null,null,null,"No","ü",null,1]
[null,null,null,null,null,null,null,null,null,null,2]
[null,null,null,null,null,null,null,null,null,null,3]
[null,null,null,null,null,null,null,null,null,null,4]
[null,null,null,{"$f":"D31+1","v":7},"Checkboxes","How many scam emails do you receive?",null,"More than 15","ü",null,0]
[null,null,null,null,null,null,null,"From 10 to 15","ü",null,1]
[null,null,null,null,null,null,null,"From 5 to 10",null,null,2]
[null,null,null,null,null,null,null,"Fewer than 5",null,null,3]
[null,null,null,null,null,null,null,null,null,null,4]
[null,null,null,{"$f":"D36+1","v":8},"Multiple Choice","Do you implement website access and download restrictions?",null,"Yes",null,null,0]
[null,null,null,null,null,null,null,"No","ü",null,1]
[null,null,null,null,null,null,null,null,null,null,2]
[null,null,null,null,null,null,null,null,null,null,3]
[null,null,null,null,null,null,null,null,null,null,4]
[null,null,null,{"$f":"D41+1","v":9},"Multiple Choice","Do you implement email download restrictions?",null,"Yes",null,null,0]
[null,null,null,null,null,null,null,"No","ü",null,1]
[null,null,null,null,null,null,null,null,null,null,2]
[null,null,null,null,null,null,null,null,null,null,3]
[null,null,null,null,null,null,null,null,null,null,4]
[null,null,null,{"$f":"D46+1","v":10},"Checkboxes","What is your average income?",null,"<100,000","ü",null,0]
[null,null,null,null,null,null,null,">100,000","ü",null,1]
[null,null,null,null,null,null,null,null,null,null,2]
[null,null,null,null,null,null,null,null,null,null,3]
[null,null,null,null,null,null,null,null,null,null,4]
[null,null,null,{"$f":"D51+1","v":11},"Multiple Choice","Do you have a secure internet connection?",null,"Yes",null,null,0]
[null,null,null,null,null,null,null,"No","ü",null,1]
[null,null,null,null,null,null,null,null,null,null,2]
[null,null,null,null,null,null,null,null,null,null,3]
[null,null,null,null,null,null,null,null,null,null,4]
[null,null,null,{"$f":"D56+1","v":12},"Multiple Choice","Do you use a VPN?",null,"Yes",null,null,0]
[null,null,null,null,null,null,null,"No","ü",null,1]
[null,null,null,null,null,null,null,null,null,null,2]
[null,null,null,null,null,null,null,null,null,null,3]
[null,null,null,null,null,null,null,null,null,null,4]
[null,null,null,{"$f":"D61+1","v":13},"Multiple Choice","Do you implement White list for inputs?",null,"Yes","ü",null,0]
[null,null,null,null,null,null,null,"No",null,null,1]
[null,null,null,null,null,null,null,null,null,null,2]
[null,null,null,null,null,null,null,null,null,null,3]
[null,null,null,null,null,null,null,null,null,null,4]
[null,null,null,{"$f":"D66+1","v":14},"Multiple Choice","Do you parameterise statements?",null,"Yes","ü",null,0]
[null,null,null,null,null,null,null,"No",null,null,1]
[null,null,null,null,null,null,null,null,null,null,2]
[null,null,null,null,null,null,null,null,null,null,3]
[null,null,null,null,null,null,null,null,null,null,4]
[null,null,null,{"$f":"D71+1","v":15},"Multiple Choice","Do you utilise character escaping?",null,"Yes","ü",null,0]
[null,null,null,null,null,null,null,"No",null,null,1]
[null,null,null,null,null,null,null,null,null,null,2]
[null,null,null,null,null,null,null,null,null,null,3]
[null,null,null,null,null,null,null,null,null,null,4]
[null,null,null,{"$f":"D76+1","v":16},"Multiple Choice","Do you utilise a firewall?",null,"Yes",null,null,0]
[null,null,null,null,null,null,null,"No","ü",null,1]
[null,null,null,null,null,null,null,null,null,null,2]
[null,null,null,null,null,null,null,null,null,null,3]
[null,null,null,null,null,null,null,null,null,null,4]
[null,null,null,{"$f":"D81+1","v":17},"Multiple Choice","Do you sanitize user inputs?",null,"Yes",null,null,0]
[null,null,null,null,null,null,null,"No","ü",null,1]
[null,null,null,null,null,null,null,null,null,null,2]
[null,null,null,null,null,null,null,null,null,null,3]
[null,null,null,null,null,null,null,null,null,null,4]
[null,null,null,{"$f":"D86+1","v":18},"Multiple Choice","Do you display database error messages on the front end?",null,"Yes",null,null,0]
[null,null,null,null,null,null,null,"No","ü",null,1]
[null,null,null,null,null,null,null,null,null,null,2]
[null,null,null,null,null,null,null,null,null,null,3]
[null,null,null,null,null,null,null,null,null,null,4]
[null,null,null,{"$f":"D91+1","v":19},"Multiple Choice","Do you monitor background tasks consistently?",null,"Yes","ü",null,0]
[null,null,null,null,null,null,null,"No",null,null,1]
[null,null,null,null,null,null,null,null,null,null,2]
[null,null,null,null,null,null,null,null,null,null,3]
[null,null,null,null,null,null,null,null,null,null,4]

{"sheet":"QuizSheet","index":1,"n_rows":23,"n_cols":7,"rows_kept":23,"cut":false,"hidden":false,"merged":[[0,5,0,6],[18,5,19,6],[2,1,2,3],[23,5,24,6]]}
["Start Time","2022-04-22T19:32:28","Results",{"$f":"\"            QUIZ RESULTS\nTotal Assessment Questions: \"&QuizResults!E2&CHAR(10)&\"Worm Vulnerabilities: \"&QuizResults!F2&CHAR(10)&\"SQLi Vulnerabilities: \"&QuizResults!G2&CHAR(10)&\"\"","v":"            QUIZ RESULTS\nTotal Assessment Questions: \nWorm Vulnerabilities: 0\nSQLi Vulnerabilities: 0\n"},null,{"$f":"CreateQuiz!F4","v":"Risk Assessment Test"}]
["Quest #",null,"Type",{"$f":"IFERROR(INDEX(CreateQuiz!E6:E934,MATCH(QuizSheet!B2,QuestionNumbers,0),1),\"\")","v":""},null,{"$f":"IF(B2=\"\",\"Enter Your Name:\",\"Question #\"&B2)","v":"Enter Your Name:"}]
["Question",{"$f":"IFERROR(INDEX(CreateQuiz!$F$6:$F$934,MATCH(QuizSheet!$B$2,QuestionNumbers,0),1),\"\")","v":""}]
[null,"Options","Correct Ans.","Student Answer",null,{"$f":"IF(B2=\"\",\"Enter Your ID#:\",\"\")","v":"Enter Your ID#:"}]
["Answer 1",{"$f":"IFERROR(INDEX(CreateQuiz!$H$6:$H$934,MATCH(QuizSheet!$B$2,QuestionNumbers,0),1),0)","v":0},{"$f":"IFERROR(INDEX(CreateQuiz!$I$6:$I$934,MATCH(QuizSheet!$B$2,QuestionNumbers,0),1),\"\")","v":""}]
["Answer 2",{"$f":"IFERROR(INDEX(CreateQuiz!$H$6:$H$934,MATCH(QuizSheet!$B$2,QuestionNumbers,0)+1,1),0)","v":0},{"$f":"IFERROR(INDEX(CreateQuiz!$I$6:$I$934,MATCH(QuizSheet!$B$2,QuestionNumbers,0)+1,1),\"\")","v":""}]
["Answer 3",{"$f":"IFERROR(INDEX(CreateQuiz!$H$6:$H$934,MATCH(QuizSheet!$B$2,QuestionNumbers,0)+2,1),0)","v":0},{"$f":"IFERROR(INDEX(CreateQuiz!$I$6:$I$934,MATCH(QuizSheet!$B$2,QuestionNumbers,0)+2,1),\"\")","v":""}]
["Answer 4",{"$f":"IFERROR(INDEX(CreateQuiz!$H$6:$H$934,MATCH(QuizSheet!$B$2,QuestionNumbers,0)+3,1),0)","v":0},{"$f":"IFERROR(INDEX(CreateQuiz!$I$6:$I$934,MATCH(QuizSheet!$B$2,QuestionNumbers,0)+ 3,1),\"\")","v":""}]
["Answer 5",{"$f":"IFERROR(INDEX(CreateQuiz!$H$6:$H$934,MATCH(QuizSheet!$B$2,QuestionNumbers,0)+4,1),0)","v":0},{"$f":"IFERROR(INDEX(CreateQuiz!$I$6:$I$934,MATCH(QuizSheet!$B$2,QuestionNumbers,0)+4,1),\"\")","v":""}]
[]
["Correct Ans.",{"$f":"IF(D2=\"Multiple Choice\",INDEX(B5:B9,MATCH(\"ü\",C5:C9,0),1),)","v":0}]
["User Ans.",{"$f":"IFERROR(IF(D2=\"Multiple Choice\",INDEX(B5:B9,D5,1),),\"\")","v":0}]
["Empty Answers",{"$f":"COUNTBLANK(D5:D9)","v":5}]
[]
[]
[]
[]
[]
[null,null,null,null,null,{"$f":"B3","v":""}]
[]
[null,null,null,null,null,{"$f":"B5","v":0},{"$f":"B6","v":0}]
[null,null,null,null,null,{"$f":"B7","v":0},{"$f":"B8","v":0}]
[null,null,null,null,null,{"$f":"B9","v":0}]

{"sheet":"QuizResults","index":2,"n_rows":3,"n_cols":7,"rows_kept":3,"cut":false,"hidden":false,"merged":[]}
["Submitted On","Name","ID #","Total Time","Total Question","Correct #","Incorrect"]
[null,null,null,null,null,{"$f":"COUNTIF(E4:E99,TRUE)","v":0},{"$f":"COUNTIF(E4:E99,FALSE)","v":0}]
["Question #","Question Type","Correct Answer(s)","User Answer(s)","Correct?"]

{"sheet":"Monte Carlo","index":3,"n_rows":5004,"n_cols":9,"rows_kept":5004,"cut":false,"hidden":false,"merged":[]}
[]
[null,"Value at Risk (VaR) - Monte Carlo Risk Assessment"]
[null,null,null,null,null,null,null,null,"Seed Value:"]
["Yearly Value :",null,1000000,null,null,null,null,"Iteration",{"$f":"EXP(($C$5-0.5*$C$6^2)*$C$7/261+$C$6*SQRT($C$7/261)*_xlfn.NORM.S.INV(RAND()))","v":1.0108564586938951}]
["Risk Free Rate:",null,0,null,null,null,null,1,{"$f":"EXP(($C$5-0.5*$C$6^2)*$C$7/261+$C$6*SQRT($C$7/261)*_xlfn.NORM.S.INV(RAND()))","v":1.2472144460023082}]
["Expected Volatility:",null,0.1,null,null,null,null,2,0.88256860394365788]
["Time (days):",null,365,null,null,null,null,3,0.95196043040909728]
[null,null,null,"FAIR Standard",null,null,null,4,1.2197578237582993]
["VaR Monte Carlo",null,null,"Percent Loss",null,"Absolute Loss",null,5,0.99393480864214745]
[null,"Likely",0.95,{"$f":"1 -_xlfn.PERCENTILE.INC(I5:I5004,1-C10)","v":0.18127742718783169},null,{"$f":"D10*C4","v":181277.42718783169},null,6,0.89720887875760325]
[null,"Unlikely",0.99,{"$f":"1-_xlfn.PERCENTILE.INC(I6:I5005,1-C11)","v":0.23752734888434912},null,{"$f":"D11*C4","v":237527.34888434911},null,7,0.91774592205748795]
[null,null,null,null,null,null,null,8,1.2433666182464493]
[null,null,null,"NIST Standard",null,null,null,9,0.83534258111544291]
[null,null,null,"Percent Loss",null,"Absolute Loss",null,10,0.86741185007976263]
[null,"Likely",0.5,{"$f":" 1 -_xlfn.PERCENTILE.INC(I5:I5004,1-C15)","v":6.6810538952042364E-3},null,{"$f":"D15*C4","v":6681.0538952042361},null,11,1.1104900989492341]
[null,"Unlikely",0.9,{"$f":"1 -_xlfn.PERCENTILE.INC(I5:I5004,1-C16)","v":0.14725066331121761},null,{"$f":"D16*C4","v":147250.66331121762},null,12,0.89334701006467532]
[null,"Worst Case",0.99,{"$f":"1 -_xlfn.PERCENTILE.INC(I5:I5004,1-C17)","v":0.23752306402942036},null,{"$f":"D17*C4","v":237523.06402942035},null,13,1.0393195600792455]
[null,null,null,null,null,null,null,14,0.91268347437586761]
[null,null,null,null,null,null,null,15,1.0433231214403766]
[null,null,null,null,null,null,null,16,0.79723532097419469]
[null,null,null,null,null,null,null,17,1.0512301240554005]
[null,null,null,null,null,null,null,18,1.0586501279376537]
[null,null,null,null,null,null,null,19,0.96887838683289951]
[null,null,null,null,null,null,null,20,0.9304003756990491]
[null,null,null,null,null,null,null,21,1.0559814235929605]
[null,null,null,null,null,null,null,22,1.0930432845229845]
[null,null,null,null,null,null,null,23,0.80394249021451936]
[null,null,null,null,null,null,null,24,1.1430679762800209]
[null,null,null,null,null,null,null,25,1.0261555080304601]
[null,null,null,null,null,null,null,26,0.94125378452349173]
[null,null,null,null,null,null,null,27,1.0340806088134527]
[null,null,null,null,null,null,null,28,1.0749904598527336]
[null,null,null,null,null,null,null,29,0.78594876521063062]
[null,null,null,null,null,null,null,30,1.0195056043158472]
[null,null,null,null,null,null,null,31,1.1434665770245123]
[null,null,null,null,null,null,null,32,0.83029635713542094]
[null,null,null,null,null,null,null,33,1.0714383623462724]
[null,null,null,null,null,null,null,34,0.79585728898078512]
[null,null,null,null,null,null,null,35,0.86102570160855285]
[null,null,null,null,null,null,null,36,0.90475973143969934]
[null,null,null,null,null,null,null,37,0.94980369258555575]
[null,null,null,null,null,null,null,38,0.98222407643331622]
[null,null,null,null,null,null,null,39,0.9754908839276929]
[null,null,null,null,null,null,null,40,0.96294261984187923]
[null,null,null,null,null,null,null,41,1.1194304996866404]
[null,null,null,null,null,null,null,42,1.0454390583421505]
[null,null,null,null,null,null,null,43,0.95518136413358734]
[null,null,null,null,null,null,null,44,1.0611096154051098]
[null,null,null,null,null,null,null,45,0.96473556539741745]
[null,null,null,null,null,null,null,46,0.91397452583979322]
[null,null,null,null,null,null,null,47,0.91085314623016289]
[null,null,null,null,null,null,null,48,0.97023089762872827]
[null,null,null,null,null,null,null,49,0.93196658290576972]
[null,null,null,null,null,null,null,50,1.0797292969851706]
[null,null,null,null,null,null,null,51,0.97444212588209289]
[null,null,null,null,null,null,null,52,0.85019715533155793]
[null,null,null,null,null,null,null,53,1.007195310890042]
[null,null,null,null,null,null,null,54,0.84723486385759261]
[null,null,null,null,null,null,null,55,0.94746845771663801]
[null,null,null,null,null,null,null,56,0.91844517943514892]
[null,null,null,null,null,null,null,57,1.1535073566993848]
[null,null,null,null,null,null,null,58,1.0377591179723615]
[null,null,null,null,null,null,null,59,0.87022002491902517]
[null,null,null,null,null,null,null,60,1.1677999813102373]
[null,null,null,null,null,null,null,61,1.040450726245832]
[null,null,null,null,null,null,null,62,0.8750307334851396]
[null,null,null,null,null,null,null,63,0.8733581417313383]
[null,null,null,null,null,null,null,64,0.98129817942128561]
[null,null,null,null,null,null,null,65,{"$f":"EXP(($C$5-0.5*$C$6^2)*$C$7/261+$C$6*SQRT($C$7/261)*_xlfn.NORM.S.INV(RAND()))","v":0.78135313313393417}]
[null,null,null,null,null,null,null,66,0.94813241888520927]
[null,null,null,null,null,null,null,67,1.1466057186946477]
[null,null,null,null,null,null,null,68,0.98925783728155547]
[null,null,null,null,null,null,null,69,0.92282399788583136]
[null,null,null,null,null,null,null,70,1.0381286988980705]
[null,null,null,null,null,null,null,71,1.1117590658524881]
[null,null,null,null,null,null,null,72,1.019188543043662]
[null,null,null,null,null,null,null,73,0.90191443338509469]
[null,null,null,null,null,null,null,74,0.97829079618687476]
[null,null,null,null,null,null,null,75,0.81168890292317997]
[null,null,null,null,null,null,null,76,0.8573119332148067]
[null,null,null,null,null,null,null,77,1.2233869353608966]
[null,null,null,null,null,null,null,78,0.94107794848872861]
[null,null,null,null,null,null,null,79,0.95393392619757666]
[null,null,null,null,null,null,null,80,1.2571722546016981]
[null,null,null,null,null,null,null,81,1.1108879992507006]
[null,null,null,null,null,null,null,82,0.87875551545972663]
[null,null,null,null,null,null,null,83,0.87106973456745507]
[null,null,null,null,null,null,null,84,1.0545049829448612]
[null,null,null,null,null,null,null,85,0.87703054264453373]
[null,null,null,null,null,null,null,86,1.0102428910629315]
[null,null,null,null,null,null,null,87,1.2265851359675537]
[null,null,null,null,null,null,null,88,0.91269775735338998]
[null,null,null,null,null,null,null,89,0.99426284347385829]
[null,null,null,null,null,null,null,90,0.98772531258298824]
[null,null,null,null,null,null,null,91,0.86508414662263378]
[null,null,null,null,null,null,null,92,1.1091845681891128]
[null,null,null,null,null,null,null,93,0.93998252270110372]
[null,null,null,null,null,null,null,94,1.1908628470317795]
[null,null,null,null,null,null,null,95,1.035014360350083]
[null,null,null,null,null,null,null,96,1.1861675592948169]
[null,null,null,null,null,null,null,97,0.96420317969400304]
[null,null,null,null,null,null,null,98,1.1389774842615814]
[null,null,null,null,null,null,null,99,1.028205959518532]
[null,null,null,null,null,null,null,100,0.98234885528407601]
[null,null,null,null,null,null,null,101,1.2452071108585734]
[null,null,null,null,null,null,null,102,0.97421701691276419]
[null,null,null,null,null,null,null,103,1.1295523108875136]
[null,null,null,null,null,null,null,104,0.97942344269980453]
[null,null,null,null,null,null,null,105,0.88408485738215026]
[null,null,null,null,null,null,null,106,0.90629792922196639]
[null,null,null,null,null,null,null,107,0.98754859135347939]
[null,null,null,null,null,null,null,108,1.3256572331459253]
[null,null,null,null,null,null,null,109,1.0670613200249408]
[null,null,null,null,null,null,null,110,0.92040884404375356]
[null,null,null,null,null,null,null,111,0.83406253753686166]
[null,null,null,null,null,null,null,112,0.90425514140769914]
[null,null,null,null,null,null,null,113,1.2986459044331049]
[null,null,null,null,null,null,null,114,0.99326315437403201]
[null,null,null,null,null,null,null,115,0.8347255017623787]
[null,null,null,null,null,null,null,116,1.0528680225918152]
[null,null,null,null,null,null,null,117,0.9142034779544761]
[null,null,null,null,null,null,null,118,0.99001339398273869]
[null,null,null,null,null,null,null,119,1.1518608821202307]
[null,null,null,null,null,null,null,120,0.91249838848638576]
[null,null,null,null,null,null,null,121,0.94714908084722271]
[null,null,null,null,null,null,null,122,0.86745254514551684]
[null,null,null,null,null,null,null,123,1.2981492224166717]
[null,null,null,null,null,null,null,124,1.134666310122626]
[null,null,null,null,null,null,null,125,1.0584632996678547]
[null,null,null,null,null,null,null,126,1.1140141790322966]
[null,null,null,null,null,null,null,127,0.856108375750818]
[null,null,null,null,null,null,null,128,0.84190995930154178]
[null,null,null,null,null,null,null,129,{"$f":"EXP(($C$5-0.5*$C$6^2)*$C$7/261+$C$6*SQRT($C$7/261)*_xlfn.NORM.S.INV(RAND()))","v":1.1868057795517917}]
[null,null,null,null,null,null,null,130,1.1355839905263942]
[null,null,null,null,null,null,null,131,0.9042171306034229]
[null,null,null,null,null,null,null,132,1.0775782588655831]
[null,null,null,null,null,null,null,133,0.85116947846191493]
[null,null,null,null,null,null,null,134,0.99785057514230968]
[null,null,null,null,null,null,null,135,0.98464299519674137]
[null,null,null,null,null,null,null,136,0.93152972492660635]
[null,null,null,null,null,null,null,137,1.0946464965800558]
[null,null,null,null,null,null,null,138,1.0245019050614463]
[null,null,null,null,null,null,null,139,1.0566420334461137]
[null,null,null,null,null,null,null,140,0.95397231129681714]
[null,null,null,null,null,null,null,141,1.082073250899003]
[null,null,null,null,null,null,null,142,0.89955635751566798]
[null,null,null,null,null,null,null,143,0.88535029089954231]
[null,null,null,null,null,null,null,144,0.91056921938664859]
[null,null,null,null,null,null,null,145,0.92748152017833718]
[null,null,null,null,null,null,null,146,1.0295705293867248]
[null,null,null,null,null,null,null,147,1.1721284574464488]
[null,null,null,null,null,null,null,148,1.1021223793563346]
[null,null,null,null,null,null,null,149,1.0001356655975759]
[null,null,null,null,null,null,null,150,0.82900262568653516]
[null,null,null,null,null,null,null,151,1.14332681920241]
[null,null,null,null,null,null,null,152,0.92878900504551476]
[null,null,null,null,null,null,null,153,1.1958283157324547]
[null,null,null,null,null,null,null,154,0.97971286960717618]
[null,null,null,null,null,null,null,155,1.1520409819910475]
[null,null,null,null,null,null,null,156,0.98466394429318649]
[null,null,null,null,null,null,null,157,0.97801294111112091]
[null,null,null,null,null,null,null,158,0.94821462235784437]
[null,null,null,null,null,null,null,159,1.0215859413181572]
[null,null,null,null,null,null,null,160,0.92175677672617717]
[null,null,null,null,null,null,null,161,1.2019484976447059]
[null,null,null,null,null,null,null,162,0.76168864953473647]
[null,null,null,null,null,null,null,163,1.0036720932030079]
[null,null,null,null,null,null,null,164,1.0168828217323904]
[null,null,null,null,null,null,null,165,0.89468277617516145]
[null,null,null,null,null,null,null,166,1.1059769656060918]
[null,null,null,null,null,null,null,167,1.0280170911760291]
[null,null,null,null,null,null,null,168,0.86076260857282438]
[null,null,null,null,null,null,null,169,1.0029836838804345]
[null,null,null,null,null,null,null,170,1.0730650216911461]
[null,null,null,null,null,null,null,171,1.1057673420124523]
[null,null,null,null,null,null,null,172,0.97680623971013569]
[null,null,null,null,null,null,null,173,1.0564858926642526]
[null,null,null,null,null,null,null,174,0.84803332546720678]
[null,null,null,null,null,null,null,175,0.98067274093122248]
[null,null,null,null,null,null,null,176,1.1272770245290986]
[null,null,null,null,null,null,null,177,1.0931316006770553]
[null,null,null,null,null,null,null,178,0.96299786782153318]
[null,null,null,null,null,null,null,179,0.84317831787317854]
[null,null,null,null,null,null,null,180,1.0312858142428623]
[null,null,null,null,null,null,null,181,0.88575829085007429]
[null,null,null,null,null,null,null,182,1.051785992812817]
[null,null,null,null,null,null,null,183,0.87571719563043116]
[null,null,null,null,null,null,null,184,0.94217783746468942]
[null,null,null,null,null,null,null,185,1.2288235326414736]
[null,null,null,null,null,null,null,186,1.2147834220195526]
[null,null,null,null,null,null,null,187,0.94012414592065707]
[null,null,null,null,null,null,null,188,1.0800574741930078]
[null,null,null,null,null,null,null,189,0.92215269806455613]
[null,null,null,null,null,null,null,190,1.0191364816242581]
[null,null,null,null,null,null,null,191,0.974068559657987]
[null,null,null,null,null,null,null,192,0.89028330518451071]
[null,null,null,null,null,null,null,193,{"$f":"EXP(($C$5-0.5*$C$6^2)*$C$7/261+$C$6*SQRT($C$7/261)*_xlfn.NORM.S.INV(RAND()))","v":0.87636123952184786}]
[null,null,null,null,null,null,null,194,0.93965909031191386]
[null,null,null,null,null,null,null,195,0.97695319760592447]
[null,null,null,null,null,null,null,196,0.80343798367162278]
{"$rows_left_out":4804}